Target
Phosphatidylinositol 4,5-bisphosphate 3-kinase catalytic subunit delta isoform
Ligand
BDBM50427453
Substrate
Meas. Tech.
in vitro kinase inhibition assay
IC50
960±n/a nM
Citation
 Durden, DLMorales, GAGarlich, JR Thienopyranones as kinase and epigenetic inhibitors US Patent  US10308662 Publication Date 6/4/2019 
Target
Name:
Phosphatidylinositol 4,5-bisphosphate 3-kinase catalytic subunit delta isoform
Synonyms:
PI3-kinase p110 subunit delta PI3-kinase subunit p110-delta PIK3CD Phosphatidylinositol 4,5-biphosphate 3-kinase catalytic subunit delta (PIK3CD) Phosphatidylinositol 4,5-bisphosphate 3-kinase 110 kDa catalytic subunit delta (PI3K delta) Phosphatidylinositol 4,5-bisphosphate 3-kinase catalytic subunit delta (PI3Kdelta) Phosphatidylinositol 4,5-bisphosphate 3-kinase catalytic subunit delta isoform (PI3K delta) Phosphatidylinositol 4,5-bisphosphate 3-kinase catalytic subunit delta isoform (PI3K-delta) Phosphatidylinositol 4,5-bisphosphate 3-kinase catalytic subunit delta isoform (PI3Kdelta)
Type:
Enzyme Subunit
Mol. Mass.:
119489.41
Organism:
Homo sapiens (Human)
Description:
O00329
Residue:
1044
  
Inhibitor
Name:
BDBM50427453
Synonyms:
CHEMBL2322228 US9505780, 28
Type:
Small organic molecule
Emp. Form.:
C19H17NO5S
Mol. Mass.:
371.407
SMILES:
O=c1cc(oc2c(csc12)-c1ccc2OCCOc2c1)N1CCOCC1
: