Target
Phosphatidylinositol 4,5-bisphosphate 3-kinase catalytic subunit gamma isoform
Ligand
BDBM50427456
Substrate
Meas. Tech.
in vitro kinase inhibition assay
IC50
547±n/a nM
Citation
 Durden, DLMorales, GAGarlich, JR Thienopyranones as kinase and epigenetic inhibitors US Patent  US10308662 Publication Date 6/4/2019 
Target
Name:
Phosphatidylinositol 4,5-bisphosphate 3-kinase catalytic subunit gamma isoform
Synonyms:
PI3-kinase p110 subunit gamma PI3Kgamma PK3CG_HUMAN Phosphatidylinositol 4,5-bisphosphate 3-kinase (PI3K) Phosphatidylinositol 4,5-bisphosphate 3-kinase catalytic subunit gamma (PI3Kgamma) Phosphatidylinositol 4,5-bisphosphate 3-kinase catalytic subunit gamma isoform (PI3K) Phosphatidylinositol-4,5-bisphosphate 3-kinase catalytic subunit gamma isoform Phosphoinositide 3-kinases gamma (PI3K gamma) p120-PI3K
Type:
Enzyme Subunit
Mol. Mass.:
126470.30
Organism:
Homo sapiens (Human)
Description:
P48736
Residue:
1102
  
Inhibitor
Name:
BDBM50427456
Synonyms:
CHEMBL2326953 US9505780, 44
Type:
Small organic molecule
Emp. Form.:
C19H17NO5S
Mol. Mass.:
371.407
SMILES:
COC(=O)c1ccc(cc1)-c1csc2c1oc(cc2=O)N1CCOCC1
: