Target
Bromodomain-containing protein 4 [349-460]
Ligand
BDBM50427457
Substrate
Meas. Tech.
in vitro kinase inhibition assay
IC50
628±n/a nM
Citation
 Durden, DLMorales, GAGarlich, JR Thienopyranones as kinase and epigenetic inhibitors US Patent  US10308662 Publication Date 6/4/2019 
Target
Name:
Bromodomain-containing protein 4 [349-460]
Synonyms:
BRD4 BRD4_HUMAN HUNK1
Type:
Enzyme Catalytic Domain
Mol. Mass.:
13087.06
Organism:
Homo sapiens (Human)
Description:
O60885[349-460]
Residue:
112
  
Inhibitor
Name:
BDBM50427457
Synonyms:
CHEMBL2326952 US9505780, 25
Type:
Small organic molecule
Emp. Form.:
C20H19NO5S
Mol. Mass.:
385.434
SMILES:
CCOC(=O)c1ccc(cc1)-c1csc2c1oc(cc2=O)N1CCOCC1
: