Target
Phosphatidylinositol 3-kinase regulatory subunit beta
Ligand
BDBM50427457
Substrate
Meas. Tech.
in vitro kinase inhibition assay
IC50
1750±n/a nM
Citation
 Durden, DLMorales, GAGarlich, JR Thienopyranones as kinase and epigenetic inhibitors US Patent  US10308662 Publication Date 6/4/2019 
Target
Name:
Phosphatidylinositol 3-kinase regulatory subunit beta
Synonyms:
P85B_HUMAN PI3-kinase subunit p85-beta PIK3R2 PtdIns-3-kinase regulatory subunit beta | PtdIns-3-kinase regulatory subunit p85-beta
Type:
Enzyme Subunit
Mol. Mass.:
81542.75
Organism:
Homo sapiens (Human)
Description:
O00459
Residue:
728
  
Inhibitor
Name:
BDBM50427457
Synonyms:
CHEMBL2326952 US9505780, 25
Type:
Small organic molecule
Emp. Form.:
C20H19NO5S
Mol. Mass.:
385.434
SMILES:
CCOC(=O)c1ccc(cc1)-c1csc2c1oc(cc2=O)N1CCOCC1
: