Target
MAP kinase-activated protein kinase 2 [41-364]
Ligand
BDBM30257
Substrate
Biotinylated GST-LSP1
Meas. Tech.
Dissociation-Enhanced Lanthanide Fluorescent Immunoassay (DELFIA)
IC50
620±n/a nM
Citation
 Wu, JPWang, JAbeywardane, AAndersen, DEmmanuel, MGautschi, EGoldberg, DRKashem, MALukas, SMao, WMartin, LMorwick, TMoss, NPargellis, CPatel, URPatnaude, LPeet, GWSkow, DSnow, RJWard, YWerneburg, BWhite, A The discovery of carboline analogs as potent MAPKAP-K2 inhibitors. Bioorg Med Chem Lett 17:4664-9 (2007)  
Target
Name:
MAP kinase-activated protein kinase 2 [41-364]
Synonyms:
MAPK-Activated Protein Kinase 2 (MK2) MAPKAP kinase 2 MAPKAPK2
Type:
Serine/threonine-protein kinase
Mol. Mass.:
37477.48
Organism:
Homo sapiens (Human)
Description:
MK2 was activated with p38alpha MAPK and re-purified by GSH affinity chromatography.
Residue:
324
  
Inhibitor
Name:
BDBM30257
Synonyms:
carboline analog, 69
Type:
Small organic molecule
Emp. Form.:
C19H17N5O3
Mol. Mass.:
363.37
SMILES:
CC1CNC(=O)c2[nH]c3ccc(cc3c12)C(=O)Nc1ccc(nc1)C(N)=O
:
Substrate
Name:
Biotinylated GST-LSP1
Synonyms:
lymphocyte-specific protein 1
Type:
Other Protein Type
Mol. Mass.:
17410.08
Organism:
Description:
The GST-LSP1 179-339 substrate of MK2 was biotinylated with a 70-fold molar excess of PEO-iodoacetyl biotin (Pierce), followed by quenching with excess DTT and purification by Sephadex G-25 gel filtration.
Residue:
161