Target
MAP kinase-activated protein kinase 2 [41-364]
Ligand
BDBM30270
Substrate
Biotinylated GST-LSP1
Meas. Tech.
Dissociation-Enhanced Lanthanide Fluorescent Immunoassay (DELFIA)
IC50
45±n/a nM
Citation
 Wu, JPWang, JAbeywardane, AAndersen, DEmmanuel, MGautschi, EGoldberg, DRKashem, MALukas, SMao, WMartin, LMorwick, TMoss, NPargellis, CPatel, URPatnaude, LPeet, GWSkow, DSnow, RJWard, YWerneburg, BWhite, A The discovery of carboline analogs as potent MAPKAP-K2 inhibitors. Bioorg Med Chem Lett 17:4664-9 (2007)  
Target
Name:
MAP kinase-activated protein kinase 2 [41-364]
Synonyms:
MAPK-Activated Protein Kinase 2 (MK2) MAPKAP kinase 2 MAPKAPK2
Type:
Serine/threonine-protein kinase
Mol. Mass.:
37477.48
Organism:
Homo sapiens (Human)
Description:
MK2 was activated with p38alpha MAPK and re-purified by GSH affinity chromatography.
Residue:
324
  
Inhibitor
Name:
BDBM30270
Synonyms:
carboline analog, 82
Type:
Small organic molecule
Emp. Form.:
C20H21N5O3S
Mol. Mass.:
411.477
SMILES:
CCCNC(=O)c1csc(NC(=O)c2ccc3[nH]c4c(C(C)CNC4=O)c3c2)n1
:
Substrate
Name:
Biotinylated GST-LSP1
Synonyms:
lymphocyte-specific protein 1
Type:
Other Protein Type
Mol. Mass.:
17410.08
Organism:
Description:
The GST-LSP1 179-339 substrate of MK2 was biotinylated with a 70-fold molar excess of PEO-iodoacetyl biotin (Pierce), followed by quenching with excess DTT and purification by Sephadex G-25 gel filtration.
Residue:
161