Target
Ghrelin O-acyltransferase
Ligand
BDBM396133
Substrate
Meas. Tech.
hGOAT Activity in HEK293 Cells after Incubation
IC50
6.90±n/a nM
Citation
 Godbout, CTrieselmann, TVintonyak, V Oxadiazolopyridine derivatives for use as ghrelin O-acyl transferase (GOAT) inhibitors US Patent  US10308667 Publication Date 6/4/2019 
Target
Name:
Ghrelin O-acyltransferase
Synonyms:
GOAT MBOA4_HUMAN Membrane-bound O-acyltransferase domain-containing protein 4 OACT4
Type:
Enzyme
Mol. Mass.:
49733.10
Organism:
Homo sapiens (Human)
Description:
Q96T53
Residue:
435
  
Inhibitor
Name:
BDBM396133
Synonyms:
6-(7-amino-5-methyl-[1,2,5]oxadiazolo[3,4-b]pyridin-6-ylmethyl)-4-(trifluoromethyl)pyridine-2-carbonitrile | US10308667, Example 36
Type:
Small organic molecule
Emp. Form.:
C14H9F3N6O
Mol. Mass.:
334.2561
SMILES:
Cc1nc2nonc2c(N)c1Cc1cc(cc(n1)C#N)C(F)(F)F
: