Target
Ghrelin O-acyltransferase
Ligand
BDBM396135
Substrate
Meas. Tech.
hGOAT Activity in HEK293 Cells after Incubation
IC50
2.60±n/a nM
Citation
 Godbout, CTrieselmann, TVintonyak, V Oxadiazolopyridine derivatives for use as ghrelin O-acyl transferase (GOAT) inhibitors US Patent  US10308667 Publication Date 6/4/2019 
Target
Name:
Ghrelin O-acyltransferase
Synonyms:
GOAT MBOA4_HUMAN Membrane-bound O-acyltransferase domain-containing protein 4 OACT4
Type:
Enzyme
Mol. Mass.:
49733.10
Organism:
Homo sapiens (Human)
Description:
Q96T53
Residue:
435
  
Inhibitor
Name:
BDBM396135
Synonyms:
6-(7-amino-5-methyl-[1,2,5]oxadiazolo[3,4-b]pyridin-6-ylmethyl)-4-chloropyridine-2-carbonitrile | US10308667, Example 38
Type:
Small organic molecule
Emp. Form.:
C13H9ClN6O
Mol. Mass.:
300.703
SMILES:
Cc1nc2nonc2c(N)c1Cc1cc(Cl)cc(n1)C#N
: