Target
Ghrelin O-acyltransferase
Ligand
BDBM396212
Substrate
Meas. Tech.
hGOAT Activity in HEK293 Cells after Incubation
IC50
1.20±n/a nM
Citation
 Godbout, CTrieselmann, TVintonyak, V Oxadiazolopyridine derivatives for use as ghrelin O-acyl transferase (GOAT) inhibitors US Patent  US10308667 Publication Date 6/4/2019 
Target
Name:
Ghrelin O-acyltransferase
Synonyms:
GOAT MBOA4_HUMAN Membrane-bound O-acyltransferase domain-containing protein 4 OACT4
Type:
Enzyme
Mol. Mass.:
49733.10
Organism:
Homo sapiens (Human)
Description:
Q96T53
Residue:
435
  
Inhibitor
Name:
BDBM396212
Synonyms:
6-(7-Amino-5-methyl-[1,2,5]oxadiazolo[3,4-b]pyridin-6-ylmethyl)-3-(2-fluoro-ethoxy)-pyridine-2-carbonitrile | US10308667, Example 115
Type:
Small organic molecule
Emp. Form.:
C15H13FN6O2
Mol. Mass.:
328.3011
SMILES:
Cc1nc2nonc2c(N)c1Cc1ccc(OCCF)c(n1)C#N
: