Target
MAP kinase-activated protein kinase 2
Ligand
BDBM30310
Substrate
Hsp27 Substrate Peptide
Meas. Tech.
MK2 Enzyme Inhibition Assay
pH
7.5±n/a
Temperature
295.15±n/a K
IC50
1230±n/a nM
Citation
 Schlapbach, AFeifel, RHawtin, SHeng, RKoch, GMoebitz, HRevesz, LScheufler, CVelcicky, JWaelchli, RHuppertz, C Pyrrolo-pyrimidones: a novel class of MK2 inhibitors with potent cellular activity. Bioorg Med Chem Lett 18:6142-6 (2008)  
Target
Name:
MAP kinase-activated protein kinase 2
Synonyms:
MAP kinase-activated protein kinase 2 (MAPKAPK2) MAP kinase-activated protein kinase 2 (p38/MK2) MAPK-activated protein kinase 2 MAPKAP kinase 2 MAPKAPK2 | MK2
Type:
Serine/threonine-protein kinase
Mol. Mass.:
45579.87
Organism:
Homo sapiens (Human)
Description:
P49137
Residue:
400
  
Inhibitor
Name:
BDBM30310
Synonyms:
Pyrrolo-pyrimidone, 3
Type:
Small organic molecule
Emp. Form.:
C17H11FN4O
Mol. Mass.:
306.2938
SMILES:
Fc1cccc(c1)-c1cc(ccn1)-c1cc2c(nc[nH]c2=O)[nH]1
:
Substrate
Name:
Hsp27 Substrate Peptide
Synonyms:
Type:
Biotinylated peptide
Mol. Mass.:
2940.84
Organism:
Description:
Residue:
26