Target
Bile acid receptor
Ligand
BDBM30332
Substrate
BDBM10852
Meas. Tech.
FXR Transient Transfection Assay
EC50
3300±n/a nM
Comments
27% efficacy.
Citation
 Akwabi-Ameyaw, ABass, JYCaldwell, RDCaravella, JAChen, LCreech, KLDeaton, DNJones, SAKaldor, ILiu, YMadauss, KPMarr, HBMcFadyen, RBMiller, ABIii, FNParks, DJSpearing, PKTodd, DWilliams, SPWisely, GB Conformationally constrained farnesoid X receptor (FXR) agonists: Naphthoic acid-based analogs of GW 4064. Bioorg Med Chem Lett 18:4339-43 (2008)  
Target
Name:
Bile acid receptor
Synonyms:
BAR FXR HRR1 NR1H4_HUMAN RIP14 Retinoid X receptor-interacting protein 14 | farnesoid x receptor
Type:
Nuclear Receptor
Mol. Mass.:
55916.24
Organism:
Homo sapiens (Human)
Description:
Q96RI1
Residue:
486
  
Inhibitor
Name:
BDBM30332
Synonyms:
Naphthoic acid-based analog, 1e
Type:
Small organic molecule
Emp. Form.:
C30H23Cl2NO4
Mol. Mass.:
532.414
SMILES:
CC(C)c1onc(c1COc1ccc(cc1)-c1ccc2cccc(C(O)=O)c2c1)-c1c(Cl)cccc1Cl
:
Substrate