Target
Catenin beta-1
Ligand
BDBM396286
Substrate
Meas. Tech.
Wnt activity assay
IC50
13.0±n/a nM
Citation
 Kc, SKWallace, DMHood, JBarroga, CF β- and γ-diketones and γ-hydroxyketones as Wnt/β-catenin signaling pathway activators US Patent  US10314832 Publication Date 6/11/2019 
Target
Name:
Catenin beta-1
Synonyms:
CTNB1_HUMAN CTNNB1
Type:
PROTEIN
Mol. Mass.:
85484.08
Organism:
Homo sapiens (Human)
Description:
ChEMBL_1504364
Residue:
781
  
Inhibitor
Name:
BDBM396286
Synonyms:
US10314832, Compound 2
Type:
Small organic molecule
Emp. Form.:
C17H15NO4
Mol. Mass.:
297.3053
SMILES:
O=C(CCC(=O)c1ccccn1)c1ccc2OCCOc2c1
: