Target
Catenin beta-1
Ligand
BDBM396288
Substrate
Meas. Tech.
Wnt activity assay
IC50
>10000±n/a nM
Citation
 Kc, SKWallace, DMHood, JBarroga, CF β- and γ-diketones and γ-hydroxyketones as Wnt/β-catenin signaling pathway activators US Patent  US10314832 Publication Date 6/11/2019 
Target
Name:
Catenin beta-1
Synonyms:
CTNB1_HUMAN CTNNB1
Type:
PROTEIN
Mol. Mass.:
85484.08
Organism:
Homo sapiens (Human)
Description:
ChEMBL_1504364
Residue:
781
  
Inhibitor
Name:
BDBM396288
Synonyms:
US10314832, Compound 11 | US10314832, Compound 4
Type:
Small organic molecule
Emp. Form.:
C22H24O7
Mol. Mass.:
400.4218
SMILES:
COCCOCOc1ccc(cc1)C(=O)CCC(=O)c1ccc2OCCOc2c1
: