Target
Catenin beta-1
Ligand
BDBM396301
Substrate
Meas. Tech.
Wnt activity assay
IC50
6000±n/a nM
Citation
 Kc, SKWallace, DMHood, JBarroga, CF β- and γ-diketones and γ-hydroxyketones as Wnt/β-catenin signaling pathway activators US Patent  US10314832 Publication Date 6/11/2019 
Target
Name:
Catenin beta-1
Synonyms:
CTNB1_HUMAN CTNNB1
Type:
PROTEIN
Mol. Mass.:
85484.08
Organism:
Homo sapiens (Human)
Description:
ChEMBL_1504364
Residue:
781
  
Inhibitor
Name:
BDBM396301
Synonyms:
US10314832, Compound 18
Type:
Small organic molecule
Emp. Form.:
C21H22O4
Mol. Mass.:
338.397
SMILES:
CCC(CC)(C(=O)c1ccccc1)C(=O)c1ccc2OCCOc2c1
: