Target
Serine protease HTRA1
Ligand
BDBM396311
Substrate
Meas. Tech.
Enzyme Inhibition Assay
IC50
80.0±n/a nM
Citation
 Hornsperger, BIacone, RKuhn, BMaerki, HPMohr, PReutlinger, M Trifluoromethylpropanamide derivatives US Patent  US9980929 Publication Date 5/29/2018 
Target
Name:
Serine protease HTRA1
Synonyms:
HTRA HTRA1_HUMAN | PRSS11
Type:
Protein
Mol. Mass.:
51293.95
Organism:
Homo sapiens (Human)
Description:
Q92743
Residue:
480
  
Inhibitor
Name:
BDBM396311
Synonyms:
US9980929, Example 9
Type:
Small organic molecule
Emp. Form.:
C31H31Cl2F3N2O4
Mol. Mass.:
623.49
SMILES:
COc1ccc(cc1)C(CC(=O)N[C@@H](Cc1ccc(Cl)cc1)C(=O)N[C@@H](C(C)C)C(=O)C(F)(F)F)c1ccc(Cl)cc1
: