Target
Serine protease HTRA1
Ligand
BDBM396332
Substrate
Meas. Tech.
Enzyme Inhibition Assay
IC50
20.0±n/a nM
Citation
 Hornsperger, BIacone, RKuhn, BMaerki, HPMohr, PReutlinger, M Trifluoromethylpropanamide derivatives US Patent  US9980929 Publication Date 5/29/2018 
Target
Name:
Serine protease HTRA1
Synonyms:
HTRA HTRA1_HUMAN | PRSS11
Type:
Protein
Mol. Mass.:
51293.95
Organism:
Homo sapiens (Human)
Description:
Q92743
Residue:
480
  
Inhibitor
Name:
BDBM396332
Synonyms:
US9980929, Example 30
Type:
Small organic molecule
Emp. Form.:
C23H22Cl3F3N2O3
Mol. Mass.:
537.787
SMILES:
CC(C)[C@H](NC(=O)[C@@H](NC(=O)CCc1ccc(Cl)c(Cl)c1)c1ccc(Cl)cc1)C(=O)C(F)(F)F
: