Target
Serine protease HTRA1
Ligand
BDBM396370
Substrate
Meas. Tech.
Enzyme Inhibition Assay
IC50
58.9±n/a nM
Citation
 Hornsperger, BIacone, RKuhn, BMaerki, HPMohr, PReutlinger, M Trifluoromethylpropanamide derivatives US Patent  US9980929 Publication Date 5/29/2018 
Target
Name:
Serine protease HTRA1
Synonyms:
HTRA HTRA1_HUMAN | PRSS11
Type:
Protein
Mol. Mass.:
51293.95
Organism:
Homo sapiens (Human)
Description:
Q92743
Residue:
480
  
Inhibitor
Name:
BDBM396370
Synonyms:
US9980929, Example 72
Type:
Small organic molecule
Emp. Form.:
C28H26Cl2F3N3O4
Mol. Mass.:
596.425
SMILES:
CC(C)[C@H](NC(=O)[C@@H](NC(=O)[C@@H](Cc1cccnc1)Oc1cc(Cl)cc(Cl)c1)c1ccccc1)C(=O)C(F)(F)F
: