Target
Serine protease HTRA1
Ligand
BDBM396375
Substrate
Meas. Tech.
Enzyme Inhibition Assay
IC50
345±n/a nM
Citation
 Hornsperger, BIacone, RKuhn, BMaerki, HPMohr, PReutlinger, M Trifluoromethylpropanamide derivatives US Patent  US9980929 Publication Date 5/29/2018 
Target
Name:
Serine protease HTRA1
Synonyms:
HTRA HTRA1_HUMAN | PRSS11
Type:
Protein
Mol. Mass.:
51293.95
Organism:
Homo sapiens (Human)
Description:
Q92743
Residue:
480
  
Inhibitor
Name:
BDBM396375
Synonyms:
US9980929, Example 77
Type:
Small organic molecule
Emp. Form.:
C24H24F3N3O5
Mol. Mass.:
491.4597
SMILES:
COc1ccc(cc1)[C@H](NC(=O)COc1cccc(c1)C#N)C(=O)N[C@@H](C(C)C)C(=O)C(F)(F)F
: