Target
Serine/threonine-protein kinase/endoribonuclease IRE1
Ligand
BDBM110973
Substrate
Meas. Tech.
In Vitro Assay
IC50
70.0±n/a nM
Citation
 Patterson, JBLonergan, DGFlynn, GAZeng, QPallai, PV IRE-1α inhibitors US Patent  US9981901 Publication Date 5/29/2018 
Target
Name:
Serine/threonine-protein kinase/endoribonuclease IRE1
Synonyms:
ERN1 Endoplasmic reticulum-to-nucleus signaling 1 IRE1 Inositol requiring enzyme 1 (IRE-1alpha) Inositol-requiring protein 1 Ire1-alpha Serine/threonine-protein kinase/endoribonuclease IRE1 hIRE1p
Type:
Enzyme
Mol. Mass.:
109731.20
Organism:
Homo sapiens (Human)
Description:
O75460
Residue:
977
  
Inhibitor
Name:
BDBM110973
Synonyms:
US8614253, 3-4 US9241942, 3-4 | US9963434, Compound 3-4
Type:
Small organic molecule
Emp. Form.:
C11H7FN2O2
Mol. Mass.:
218.1839
SMILES:
Oc1c(F)cc(cc1C=O)-c1cncnc1
: