Target
5-hydroxytryptamine receptor 7
Ligand
BDBM396484
Substrate
Meas. Tech.
Binding Assay
Ki
5.00±n/a nM
Citation
 Carruthers, NIChai, WJablonowski, JAShah, CRShireman, BTSwanson, DMTran, VWong, V Serotonin receptor modulators US Patent  US9981909 Publication Date 5/29/2018 
Target
Name:
5-hydroxytryptamine receptor 7
Synonyms:
5-HT-7 5-HT7 5-HT7S 5-hydroxytryptamine receptor 7 5HT7R_RAT GPRFO Serotonin (5-HT) receptor | Serotonin Receptor 7
Type:
G Protein-Coupled Receptor (GPCR)
Mol. Mass.:
49852.62
Organism:
Rattus norvegicus (rat)
Description:
Rat cloned 5-HT7R.
Residue:
448
  
Inhibitor
Name:
BDBM396484
Synonyms:
(+-)-3-[5-Chloro-2-[1-(3-trifluoromethyl-phenyl)-ethoxy]-phenoxy]-1-methyl- | US9981909, Example 109
Type:
Small organic molecule
Emp. Form.:
C19H19ClF3NO2
Mol. Mass.:
385.808
SMILES:
CC(Oc1ccc(Cl)cc1OC1CN(C)C1)c1cccc(c1)C(F)(F)F
: