Target
5-hydroxytryptamine receptor 7
Ligand
BDBM396570
Substrate
Meas. Tech.
Binding Assay
Ki
2.00±n/a nM
Citation
 Carruthers, NIChai, WJablonowski, JAShah, CRShireman, BTSwanson, DMTran, VWong, V Serotonin receptor modulators US Patent  US9981909 Publication Date 5/29/2018 
Target
Name:
5-hydroxytryptamine receptor 7
Synonyms:
5-HT-7 5-HT7 5-HT7S 5-hydroxytryptamine receptor 7 5HT7R_RAT GPRFO Serotonin (5-HT) receptor | Serotonin Receptor 7
Type:
G Protein-Coupled Receptor (GPCR)
Mol. Mass.:
49852.62
Organism:
Rattus norvegicus (rat)
Description:
Rat cloned 5-HT7R.
Residue:
448
  
Inhibitor
Name:
BDBM396570
Synonyms:
3-(5-Bromo-2-phenethyloxy-phenoxy)-azetidine | US9981909, Example 195
Type:
Small organic molecule
Emp. Form.:
C17H18BrNO2
Mol. Mass.:
348.234
SMILES:
Brc1ccc(OCCc2ccccc2)c(OC2CNC2)c1
: