Target
Genome polyprotein
Ligand
BDBM30421
Substrate
biotinylated oligo (rG13)/poly rC
Meas. Tech.
NS5B Polymerase Inhibition Assay (IC50) and HCV Replicon Assay (EC50)
pH
7.5±n/a
Temperature
301.15±n/a K
IC50
130±n/a nM
EC50
380±n/a nM
Citation
 Ruebsam, FWebber, SETran, MTTran, CVMurphy, DEZhao, JDragovich, PSKim, SHLi, LSZhou, YHan, QKissinger, CRShowalter, RELardy, MShah, AMTsan, MPatel, RLebrun, LAKamran, RSergeeva, MVBartkowski, DMNolan, TGNorris, DAKirkovsky, L Pyrrolo[1,2-b]pyridazin-2-ones as potent inhibitors of HCV NS5B polymerase. Bioorg Med Chem Lett 18:3616-21 (2008)  
Target
Name:
Genome polyprotein
Synonyms:
Genome polyprotein POLG_HCVBK | RNA-directed RNA polymerase (NS5B)
Type:
Protein
Mol. Mass.:
327252.46
Organism:
Hepatitis C virus genotype 1b (isolate BK) (HCV)
Description:
P26663
Residue:
3010
  
Inhibitor
Name:
BDBM30421
Synonyms:
Racemic | pyrrolo[1,2-b]pyridazin-2-one analog., 3n
Type:
Small organic molecule
Emp. Form.:
C25H21FN4O6S2
Mol. Mass.:
556.586
SMILES:
Oc1c(C2=Nc3ccc(cc3S(=O)(=O)N2)C2CCCS2(=O)=O)c(=O)n(Cc2ccc(F)cc2)n2cccc12
:
Substrate
Name:
biotinylated oligo (rG13)/poly rC
Synonyms:
Type:
RNA
Mol. Mass.:
358.43
Organism:
Description:
[alpha-33P]GTP/GTP as co-substrate.
Residue:
3
NA