Target
NADH dehydrogenase [ubiquinone] flavoprotein 1, mitochondrial
Ligand
BDBM263627
Substrate
Meas. Tech.
Submitochondrial Particle Assay
pH
7.4±n/a
IC50
<100.0±n/a nM
Comments
extracted
Citation
 Cesati, RRRadeke, HSPandey, SKPurohit, ARobinson, SP Compositions, methods, and systems for the synthesis and use of imaging agents US Patent  US9713651 Publication Date 7/25/2017 
Target
Name:
NADH dehydrogenase [ubiquinone] flavoprotein 1, mitochondrial
Synonyms:
CI-51kD NADH dehydrogenase flavoprotein 1 NDUFV1 UQOR1
Type:
PROTEIN
Mol. Mass.:
50659.85
Organism:
Bos taurus
Description:
EBI_100771
Residue:
464
  
Inhibitor
Name:
BDBM263627
Synonyms:
2-(tert-butyl)-4-chloro-5-((4-(6-nitropyridin-3-yl)benzyl)oxy)pyridazin-3(2H)-one | US9713651, 54
Type:
Small organic molecule
Emp. Form.:
C20H19ClN4O4
Mol. Mass.:
414.842
SMILES:
CC(C)(C)n1ncc(OCc2ccc(cc2)-c2ccc(nc2)[N+]([O-])=O)c(Cl)c1=O
: