Target
NADH dehydrogenase [ubiquinone] flavoprotein 1, mitochondrial
Ligand
BDBM263632
Substrate
Meas. Tech.
Submitochondrial Particle Assay
pH
7.4±n/a
IC50
<1000±n/a nM
Comments
extracted
Citation
 Cesati, RRRadeke, HSPandey, SKPurohit, ARobinson, SP Compositions, methods, and systems for the synthesis and use of imaging agents US Patent  US9713651 Publication Date 7/25/2017 
Target
Name:
NADH dehydrogenase [ubiquinone] flavoprotein 1, mitochondrial
Synonyms:
CI-51kD NADH dehydrogenase flavoprotein 1 NDUFV1 UQOR1
Type:
PROTEIN
Mol. Mass.:
50659.85
Organism:
Bos taurus
Description:
EBI_100771
Residue:
464
  
Inhibitor
Name:
BDBM263632
Synonyms:
2-(tert-butyl)-4-chloro-5-((4-(fluoromethyl)benzyl)oxy)pyridazin-3(2H)-one | US9713651, 19
Type:
Small organic molecule
Emp. Form.:
C16H18ClFN2O2
Mol. Mass.:
324.778
SMILES:
CC(C)(C)n1ncc(OCc2ccc(CF)cc2)c(Cl)c1=O
: