Target
NADH dehydrogenase [ubiquinone] flavoprotein 1, mitochondrial
Ligand
BDBM263661
Substrate
Meas. Tech.
Submitochondrial Particle Assay
pH
7.4±n/a
IC50
<100.0±n/a nM
Comments
extracted
Citation
 Cesati, RRRadeke, HSPandey, SKPurohit, ARobinson, SP Compositions, methods, and systems for the synthesis and use of imaging agents US Patent  US9713651 Publication Date 7/25/2017 
Target
Name:
NADH dehydrogenase [ubiquinone] flavoprotein 1, mitochondrial
Synonyms:
CI-51kD NADH dehydrogenase flavoprotein 1 NDUFV1 UQOR1
Type:
PROTEIN
Mol. Mass.:
50659.85
Organism:
Bos taurus
Description:
EBI_100771
Residue:
464
  
Inhibitor
Name:
BDBM263661
Synonyms:
2-((4-(((1-(tert-butyl)-5-chloro-6-oxo-1,6-dihydropyridazin-4-yl)oxy)methyl)benzyl)oxy)ethyl methyl carbonate | US9713651, 37
Type:
Small organic molecule
Emp. Form.:
C20H25ClN2O6
Mol. Mass.:
424.875
SMILES:
COC(=O)OCCOCc1ccc(COc2cnn(c(=O)c2Cl)C(C)(C)C)cc1
: