Target
RAC-alpha serine/threonine-protein kinase
Ligand
BDBM369723
Substrate
Meas. Tech.
AKT/PKB Kinase Assay
IC50
<25±n/a nM
Citation
 Huck, BRLan, RPotnick, JDeselm, LCCronin, Jr., MWNeagu, CChen, XBoivin, RJohnson, TLGoutopoulos, A Substituted benzo[d][1,2,3]triazines as p70S6K inhibitors US Patent  US9981925 Publication Date 5/29/2018 
Target
Name:
RAC-alpha serine/threonine-protein kinase
Synonyms:
AKT phosphorylation (p-AKT) AKT1/PPP1CA C-AKT PKB alpha Protein kinase B Protein kinase B (Akt 1) Protein kinase B alpha Proto-oncogene Akt (Akt1) Proto-oncogene c-Akt (AKT1) RAC-PK-alpha RAC-alpha serine/threonine-protein kinase (AKT1) | RAC-alpha serine/threonine-protein kinase (pAKT)
Type:
Enzyme
Mol. Mass.:
55681.25
Organism:
Homo sapiens (Human)
Description:
P31749
Residue:
480
  
Inhibitor
Name:
BDBM369723
Synonyms:
US10233160, Compound 13 | US9981925, Compound 13
Type:
Small organic molecule
Emp. Form.:
C19H18ClF3N6O
Mol. Mass.:
438.834
SMILES:
CN(C)C[C@@H](Nc1nnnc2c(cccc12)C(N)=O)c1ccc(Cl)c(c1)C(F)(F)F
: