Target
RAC-alpha serine/threonine-protein kinase
Ligand
BDBM369729
Substrate
Meas. Tech.
AKT/PKB Kinase Assay
IC50
>1000±n/a nM
Citation
 Huck, BRLan, RPotnick, JDeselm, LCCronin, Jr., MWNeagu, CChen, XBoivin, RJohnson, TLGoutopoulos, A Substituted benzo[d][1,2,3]triazines as p70S6K inhibitors US Patent  US9981925 Publication Date 5/29/2018 
Target
Name:
RAC-alpha serine/threonine-protein kinase
Synonyms:
AKT phosphorylation (p-AKT) AKT1/PPP1CA C-AKT PKB alpha Protein kinase B Protein kinase B (Akt 1) Protein kinase B alpha Proto-oncogene Akt (Akt1) Proto-oncogene c-Akt (AKT1) RAC-PK-alpha RAC-alpha serine/threonine-protein kinase (AKT1) | RAC-alpha serine/threonine-protein kinase (pAKT)
Type:
Enzyme
Mol. Mass.:
55681.25
Organism:
Homo sapiens (Human)
Description:
P31749
Residue:
480
  
Inhibitor
Name:
BDBM369729
Synonyms:
US10233160, Compound 19 | US9981925, Compound 19
Type:
Small organic molecule
Emp. Form.:
C20H18ClF3N6O
Mol. Mass.:
450.845
SMILES:
NC(=O)c1cncc2c(N[C@@H](CN3CCC3)c3ccc(Cl)c(c3)C(F)(F)F)ncnc12
: