Target
Ribosomal protein S6 kinase beta-1
Ligand
BDBM369746
Substrate
Meas. Tech.
Enzyme Assay
IC50
<25±n/a nM
Citation
 Huck, BRLan, RPotnick, JDeselm, LCCronin, Jr., MWNeagu, CChen, XBoivin, RJohnson, TLGoutopoulos, A Substituted benzo[d][1,2,3]triazines as p70S6K inhibitors US Patent  US9981925 Publication Date 5/29/2018 
Target
Name:
Ribosomal protein S6 kinase beta-1
Synonyms:
70 kDa ribosomal protein S6 kinase 1 70 kDa ribosomal protein kinase (p70S6K) Protein kinase 70S6K (T412E) RPS6KB1 Ribosomal protein S6 kinase I STK14A p70S6K1
Type:
Enzyme
Mol. Mass.:
59139.89
Organism:
Homo sapiens (Human)
Description:
His-tagged S6K1.
Residue:
525
  
Inhibitor
Name:
BDBM369746
Synonyms:
US10233160, Compound 37 | US9981925, Compound 37
Type:
Small organic molecule
Emp. Form.:
C22H26N6O
Mol. Mass.:
390.4814
SMILES:
CC(C)c1ccc(cc1)[C@@H](CN1CCC1)Nc1ncnc2c(ccnc12)C(N)=O
: