Target
RAC-alpha serine/threonine-protein kinase
Ligand
BDBM369746
Substrate
Meas. Tech.
AKT/PKB Kinase Assay
IC50
62.5±n/a nM
Citation
 Huck, BRLan, RPotnick, JDeselm, LCCronin, Jr., MWNeagu, CChen, XBoivin, RJohnson, TLGoutopoulos, A Substituted benzo[d][1,2,3]triazines as p70S6K inhibitors US Patent  US9981925 Publication Date 5/29/2018 
Target
Name:
RAC-alpha serine/threonine-protein kinase
Synonyms:
AKT phosphorylation (p-AKT) AKT1/PPP1CA C-AKT PKB alpha Protein kinase B Protein kinase B (Akt 1) Protein kinase B alpha Proto-oncogene Akt (Akt1) Proto-oncogene c-Akt (AKT1) RAC-PK-alpha RAC-alpha serine/threonine-protein kinase (AKT1) | RAC-alpha serine/threonine-protein kinase (pAKT)
Type:
Enzyme
Mol. Mass.:
55681.25
Organism:
Homo sapiens (Human)
Description:
P31749
Residue:
480
  
Inhibitor
Name:
BDBM369746
Synonyms:
US10233160, Compound 37 | US9981925, Compound 37
Type:
Small organic molecule
Emp. Form.:
C22H26N6O
Mol. Mass.:
390.4814
SMILES:
CC(C)c1ccc(cc1)[C@@H](CN1CCC1)Nc1ncnc2c(ccnc12)C(N)=O
: