Target
Genome polyprotein
Ligand
BDBM30511
Substrate
biotinylated oligo (rG13)/poly rC
Meas. Tech.
NS5B Polymerase Inhibition Assay (IC50)
pH
7.5±n/a
Temperature
301.15±n/a K
IC50
6500±n/a nM
Citation
 Ruebsam, FTran, CVLi, LSKim, SHXiang, AXZhou, YBlazel, JKSun, ZDragovich, PSZhao, JMcGuire, HMMurphy, DETran, MTStankovic, NEllis, DAGobbi, AShowalter, REWebber, SEShah, AMTsan, MPatel, RALebrun, LAHou, HJKamran, RSergeeva, MVBartkowski, DMNolan, TGNorris, DAKirkovsky, L 5,6-Dihydro-1H-pyridin-2-ones as potent inhibitors of HCV NS5B polymerase. Bioorg Med Chem Lett 19:451-8 (2009)  
Target
Name:
Genome polyprotein
Synonyms:
Genome polyprotein POLG_HCVBK | RNA-directed RNA polymerase (NS5B)
Type:
Protein
Mol. Mass.:
327252.46
Organism:
Hepatitis C virus genotype 1b (isolate BK) (HCV)
Description:
P26663
Residue:
3010
  
Inhibitor
Name:
BDBM30511
Synonyms:
5,6-Dihydro-1H-pyridin-2-one, 4k
Type:
Small organic molecule
Emp. Form.:
C25H36N4O6S2
Mol. Mass.:
552.707
SMILES:
CC(C)(C)CCN1C2CCCCCCC2C(=O)C(C1=O)C1=Nc2ccc(NS(C)(=O)=O)cc2S(=O)(=O)N1
:
Substrate
Name:
biotinylated oligo (rG13)/poly rC
Synonyms:
Type:
RNA
Mol. Mass.:
358.43
Organism:
Description:
[alpha-33P]GTP/GTP as co-substrate.
Residue:
3
NA