Target
Genome polyprotein
Ligand
BDBM30521
Substrate
biotinylated oligo (rG13)/poly rC
Meas. Tech.
NS5B Polymerase Inhibition Assay (IC50) and HCV Replicon Assay (EC50)
pH
7.5±n/a
Temperature
301.15±n/a K
IC50
46±n/a nM
EC50
100±n/a nM
Citation
 Ruebsam, FTran, CVLi, LSKim, SHXiang, AXZhou, YBlazel, JKSun, ZDragovich, PSZhao, JMcGuire, HMMurphy, DETran, MTStankovic, NEllis, DAGobbi, AShowalter, REWebber, SEShah, AMTsan, MPatel, RALebrun, LAHou, HJKamran, RSergeeva, MVBartkowski, DMNolan, TGNorris, DAKirkovsky, L 5,6-Dihydro-1H-pyridin-2-ones as potent inhibitors of HCV NS5B polymerase. Bioorg Med Chem Lett 19:451-8 (2009)  
Target
Name:
Genome polyprotein
Synonyms:
Genome polyprotein POLG_HCVBK | RNA-directed RNA polymerase (NS5B)
Type:
Protein
Mol. Mass.:
327252.46
Organism:
Hepatitis C virus genotype 1b (isolate BK) (HCV)
Description:
P26663
Residue:
3010
  
Inhibitor
Name:
BDBM30521
Synonyms:
5,6-Dihydro-1H-pyridin-2-one, 4u
Type:
Small organic molecule
Emp. Form.:
C23H24N4O6S2
Mol. Mass.:
516.59
SMILES:
CS(=O)(=O)Nc1ccc2N=C(NS(=O)(=O)c2c1)C1C(=O)C2CCCC2N(Cc2ccccc2)C1=O
:
Substrate
Name:
biotinylated oligo (rG13)/poly rC
Synonyms:
Type:
RNA
Mol. Mass.:
358.43
Organism:
Description:
[alpha-33P]GTP/GTP as co-substrate.
Residue:
3
NA