Target
Genome polyprotein
Ligand
BDBM30543
Substrate
biotinylated oligo (rG13)/poly rC
Meas. Tech.
NS5B Polymerase Inhibition Assay (IC50) and HCV Replicon Assay (EC50)
IC50
29±n/a nM
Citation
 Ruebsam, FTran, CVLi, LSKim, SHXiang, AXZhou, YBlazel, JKSun, ZDragovich, PSZhao, JMcGuire, HMMurphy, DETran, MTStankovic, NEllis, DAGobbi, AShowalter, REWebber, SEShah, AMTsan, MPatel, RALebrun, LAHou, HJKamran, RSergeeva, MVBartkowski, DMNolan, TGNorris, DAKirkovsky, L 5,6-Dihydro-1H-pyridin-2-ones as potent inhibitors of HCV NS5B polymerase. Bioorg Med Chem Lett 19:451-8 (2009)  
Target
Name:
Genome polyprotein
Synonyms:
Dipeptidyl peptidase 4 (DPP4) NS3 NS5B NS3-4A Protease NS3/4A protease POLG_HCV77 | RNA polymerase (NS5B)
Type:
Protease Domain
Mol. Mass.:
327221.49
Organism:
Hepatitis C virus (HCV genotype 1a, isolate H)
Description:
P27958
Residue:
3011
  
Inhibitor
Name:
BDBM30543
Synonyms:
5,6-Dihydro-1H-pyridin-2-one, 4ao
Type:
Small organic molecule
Emp. Form.:
C23H22F2N4O6S2
Mol. Mass.:
552.571
SMILES:
[H][C@]12CCC[C@@]1([H])C(=O)C(C(=O)N2Cc1ccc(F)c(F)c1)C1=Nc2ccc(NS(C)(=O)=O)cc2S(=O)(=O)N1
:
Substrate
Name:
biotinylated oligo (rG13)/poly rC
Synonyms:
Type:
RNA
Mol. Mass.:
358.43
Organism:
Description:
[alpha-33P]GTP/GTP as co-substrate.
Residue:
3
NA