Target
Potassium voltage-gated channel subfamily H member 2
Ligand
BDBM396802
Substrate
Meas. Tech.
Inhibition Assay
IC50
>10000±n/a nM
Citation
 Schindler, RLankau, HHöfgen, NEgerland, ULangen, BDost, RWard, S Triazoles as NR2B receptor inhibitors US Patent  US9981950 Publication Date 5/29/2018 
Target
Name:
Potassium voltage-gated channel subfamily H member 2
Synonyms:
1,3-beta-glucan synthase component GLS2 ERG Eag-related protein 1 Ether-a-go-go-related gene (HERG) Ether-a-go-go-related gene potassium channel 1 Ether-a-go-go-related gene potassium channel 1 (hERG1) Ether-a-go-go-related protein 1 H-ERG KCNH2 Potassium voltage-gated channel subfamily H member 2 (hERG) Voltage-gated potassium channel subunit Kv11.1 hERG Potassium Channel 1 | putative potassium channel subunit
Type:
Multi-pass membrane protein
Mol. Mass.:
126672.65
Organism:
Homo sapiens (Human)
Description:
Q12809
Residue:
1159
  
Inhibitor
Name:
BDBM396802
Synonyms:
US9981950, Example 9
Type:
Small organic molecule
Emp. Form.:
C12H11ClN6
Mol. Mass.:
274.709
SMILES:
Cc1ncn(Cc2cn(nn2)-c2ccc(Cl)cc2)n1
: