Target
Potassium voltage-gated channel subfamily H member 2
Ligand
BDBM396823
Substrate
Meas. Tech.
Inhibition Assay
IC50
7200±n/a nM
Citation
 Schindler, RLankau, HHöfgen, NEgerland, ULangen, BDost, RWard, S Triazoles as NR2B receptor inhibitors US Patent  US9981950 Publication Date 5/29/2018 
Target
Name:
Potassium voltage-gated channel subfamily H member 2
Synonyms:
1,3-beta-glucan synthase component GLS2 ERG Eag-related protein 1 Ether-a-go-go-related gene (HERG) Ether-a-go-go-related gene potassium channel 1 Ether-a-go-go-related gene potassium channel 1 (hERG1) Ether-a-go-go-related protein 1 H-ERG KCNH2 Potassium voltage-gated channel subfamily H member 2 (hERG) Voltage-gated potassium channel subunit Kv11.1 hERG Potassium Channel 1 | putative potassium channel subunit
Type:
Multi-pass membrane protein
Mol. Mass.:
126672.65
Organism:
Homo sapiens (Human)
Description:
Q12809
Residue:
1159
  
Inhibitor
Name:
BDBM396823
Synonyms:
2-tert-butyl-1H- imidazole 4-(2-tert-Butyl-imidazol-1-ylmethyl)-1-(4-chloro- phenyl)-1H-[1,2,3]triazole | US9981950, Example 30
Type:
Small organic molecule
Emp. Form.:
C16H18ClN5
Mol. Mass.:
315.801
SMILES:
CC(C)(C)c1nccn1Cc1cn(nn1)-c1ccc(Cl)cc1
: