Target
Runt-related transcription factor 1
Ligand
BDBM29633
Substrate
Venus-CBFbeta-SMMHC
Meas. Tech.
uHTS identification of compounds inhibiting the binding between the RUNX1 Runt domain and CBFb-SMMHC via a fluorescence resonance energy transfer (FRET) assay.
pH
7.4±n/a
Temperature
296.15±n/a K
IC50
100000±n/a nM
Citation
 PubChem, PC uHTS identification of compounds inhibiting the binding between the RUNX1 Runt domain and CBFbeta-SMMHC via a fluorescence resonance energy transfer (FRET) assay. PubChem Bioassay (2009)[AID] 
Target
Name:
Runt-related transcription factor 1
Synonyms:
AML1 CBF-alpha-2 Core-binding factor subunit alpha-2 Polyomavirus enhancer-binding protein 2 alpha B subunit RUNX1_HUMAN | Runt-Related Transcription Factor 1 Isoform AML1C
Type:
Subunit of heterodimeric transcription factor
Mol. Mass.:
48750.25
Organism:
Homo sapiens (Human)
Description:
Q01196
Residue:
453
  
Inhibitor
Name:
BDBM29633
Synonyms:
4-[(4-methyl-2,3-dihydro-1,4-benzothiazine-6-carbonyl)amino]piperidine-1-carboxylic acid ethyl ester MLS000093085 cid_3236020 ethyl 4-[(4-methyl-2,3-dihydro-1,4-benzothiazine-6-carbonyl)amino]piperidine-1-carboxylate | ethyl 4-{[(4-methyl-3,4-dihydro-2H-1,4-benzothiazin-6-yl)carbonyl]amino}piperidine-1-carboxylate
Type:
Small organic molecule
Emp. Form.:
C18H25N3O3S
Mol. Mass.:
363.474
SMILES:
CCOC(=O)N1CCC(CC1)NC(=O)c1ccc2SCCN(C)c2c1
:
Substrate
Name:
Core-binding factor subunit beta isoform 2
Synonyms:
CBFB PEBB_HUMAN Venus-core-binding factor subunit beta-smooth muscle myosin heavy chain
Type:
Fluorescent fusion protein
Mol. Mass.:
21988.19
Organism:
Homo sapiens (Human)
Description:
Q13951-2
Residue:
187