Target
Runt-related transcription factor 1
Ligand
BDBM30644
Substrate
Venus-CBFbeta-SMMHC
Meas. Tech.
Confirmation of compounds inhibiting the binding between the RUNX1 Runt domain and CBFb-SMMHC via a fluorescence resonance energy transfer (FRET) assay
pH
7.4±n/a
Temperature
296.15±n/a K
IC50
100000±n/a nM
Citation
 PubChem, PC Confirmation of compounds inhibiting the binding between the RUNX1 Runt domain and CBFb-SMMHC via a fluorescence resonance energy transfer (FRET) assay PubChem Bioassay (2009)[AID] 
Target
Name:
Runt-related transcription factor 1
Synonyms:
AML1 CBF-alpha-2 Core-binding factor subunit alpha-2 Polyomavirus enhancer-binding protein 2 alpha B subunit RUNX1_HUMAN | Runt-Related Transcription Factor 1 Isoform AML1C
Type:
Subunit of heterodimeric transcription factor
Mol. Mass.:
48750.25
Organism:
Homo sapiens (Human)
Description:
Q01196
Residue:
453
  
Inhibitor
Name:
BDBM30644
Synonyms:
5-ethyl-N-(4-thiazolo[5,4-b]pyridin-2-ylphenyl)thiophene-2-sulfonamide 5-ethyl-N-[4-([1,3]thiazolo[5,4-b]pyridin-2-yl)phenyl]thiophene-2-sulfonamide cid_9550341
Type:
Small organic molecule
Emp. Form.:
C18H15N3O2S3
Mol. Mass.:
401.526
SMILES:
CCc1ccc(s1)S(=O)(=O)Nc1ccc(cc1)-c1nc2cccnc2s1
:
Substrate
Name:
Core-binding factor subunit beta isoform 2
Synonyms:
CBFB PEBB_HUMAN Venus-core-binding factor subunit beta-smooth muscle myosin heavy chain
Type:
Fluorescent fusion protein
Mol. Mass.:
21988.19
Organism:
Homo sapiens (Human)
Description:
Q13951-2
Residue:
187