Target
5-hydroxytryptamine receptor 1A
Ligand
BDBM30675
Substrate
Not Available
Meas. Tech.
Dose Response Assay for Agonists of 5-Hydroxytryptamine (Serotonin) Receptor Subtype 1A (5HT1A)
pH
7.4±n/a
Temperature
296.15±n/a K
EC50
99000±n/a nM
Citation
 PubChem, PC Dose Response Assay for 5-Hydroxytryptamine (Serotonin) Receptor Subtype 1a (5HT1a) Agonists PubChem Bioassay (2007)[AID] 
Target
Name:
5-hydroxytryptamine receptor 1A
Synonyms:
5-HT-1A 5-hydroxytryptamine receptor 1A (5-HT-1A) ADRB2RL1 Dopamine D2 receptor and serotonin 1a receptor HTR1A | Serotonin receptor 1A
Type:
Mol. Mass.:
46122.49
Organism:
Homo sapiens (Human)
Description:
Residue:
422
  
Inhibitor
Name:
BDBM30675
Synonyms:
3-Fluoro-N-{1-[(2-fluoro-benzylcarbamoyl)-methyl]-piperidin-4-yl}-benzamide 3-fluoro-N-[1-[2-[(2-fluorobenzyl)amino]-2-keto-ethyl]-4-piperidyl]benzamide 3-fluoro-N-[1-[2-[(2-fluorophenyl)methylamino]-2-oxoethyl]piperidin-4-yl]benzamide SMR000006735 | cid_651951
Type:
Small organic molecule
Emp. Form.:
C21H23F2N3O2
Mol. Mass.:
387.423
SMILES:
Fc1cccc(c1)C(=O)NC1CCN(CC(=O)NCc2ccccc2F)CC1
:
Substrate
Name:
Not Available
Synonyms:
Type:
Mol. Mass.:
358.43
Organism:
Description:
Residue:
3
NA