Target
5-hydroxytryptamine receptor 1A
Ligand
BDBM30681
Substrate
Not Available
Meas. Tech.
Dose Response Assay for Agonists of 5-Hydroxytryptamine (Serotonin) Receptor Subtype 1A (5HT1A)
pH
7.4±n/a
Temperature
296.15±n/a K
EC50
99000±n/a nM
Citation
 PubChem, PC Dose Response Assay for 5-Hydroxytryptamine (Serotonin) Receptor Subtype 1a (5HT1a) Agonists PubChem Bioassay (2007)[AID] 
Target
Name:
5-hydroxytryptamine receptor 1A
Synonyms:
5-HT-1A 5-hydroxytryptamine receptor 1A (5-HT-1A) ADRB2RL1 Dopamine D2 receptor and serotonin 1a receptor HTR1A | Serotonin receptor 1A
Type:
Mol. Mass.:
46122.49
Organism:
Homo sapiens (Human)
Description:
Residue:
422
  
Inhibitor
Name:
BDBM30681
Synonyms:
2-furancarboxylic acid [2-(cyclopentylamino)-1-(2-fluorophenyl)-2-oxoethyl] ester MLS000073660 [2-(cyclopentylamino)-1-(2-fluorophenyl)-2-oxidanylidene-ethyl] furan-2-carboxylate cid_652816 | furan-2-carboxylic acid [2-(cyclopentylamino)-1-(2-fluorophenyl)-2-keto-ethyl] ester
Type:
Small organic molecule
Emp. Form.:
C18H18FNO4
Mol. Mass.:
331.3382
SMILES:
Fc1ccccc1C(OC(=O)c1ccco1)C(=O)NC1CCCC1
:
Substrate
Name:
Not Available
Synonyms:
Type:
Mol. Mass.:
358.43
Organism:
Description:
Residue:
3
NA