Target
5-hydroxytryptamine receptor 1A
Ligand
BDBM30682
Substrate
Not Available
Meas. Tech.
Dose Response Assay for Agonists of 5-Hydroxytryptamine (Serotonin) Receptor Subtype 1A (5HT1A)
pH
7.4±n/a
Temperature
296.15±n/a K
EC50
4993±n/a nM
Citation
 PubChem, PC Dose Response Assay for 5-Hydroxytryptamine (Serotonin) Receptor Subtype 1a (5HT1a) Agonists PubChem Bioassay (2007)[AID] 
Target
Name:
5-hydroxytryptamine receptor 1A
Synonyms:
5-HT-1A 5-hydroxytryptamine receptor 1A (5-HT-1A) ADRB2RL1 Dopamine D2 receptor and serotonin 1a receptor HTR1A | Serotonin receptor 1A
Type:
Mol. Mass.:
46122.49
Organism:
Homo sapiens (Human)
Description:
Residue:
422
  
Inhibitor
Name:
BDBM30682
Synonyms:
5-(2-furanyl)-N-[1-[(2-methylphenyl)methyl]-3-pyrazolyl]-7-(trifluoromethyl)-2-pyrazolo[1,5-a]pyrimidinecarboxamide 5-(furan-2-yl)-N-[1-[(2-methylphenyl)methyl]pyrazol-3-yl]-7-(trifluoromethyl)pyrazolo[1,5-a]pyrimidine-2-carboxamide MLS000077382 cid_652821
Type:
Small organic molecule
Emp. Form.:
C23H17F3N6O2
Mol. Mass.:
466.4153
SMILES:
Cc1ccccc1Cn1ccc(NC(=O)c2cc3nc(cc(n3n2)C(F)(F)F)-c2ccco2)n1
:
Substrate
Name:
Not Available
Synonyms:
Type:
Mol. Mass.:
358.43
Organism:
Description:
Residue:
3
NA