Target
5-hydroxytryptamine receptor 1A
Ligand
BDBM30694
Substrate
Not Available
Meas. Tech.
Dose Response Assay for Agonists of 5-Hydroxytryptamine (Serotonin) Receptor Subtype 1A (5HT1A)
pH
7.4±n/a
Temperature
296.15±n/a K
EC50
99000±n/a nM
Citation
 PubChem, PC Dose Response Assay for 5-Hydroxytryptamine (Serotonin) Receptor Subtype 1a (5HT1a) Agonists PubChem Bioassay (2007)[AID] 
Target
Name:
5-hydroxytryptamine receptor 1A
Synonyms:
5-HT-1A 5-hydroxytryptamine receptor 1A (5-HT-1A) ADRB2RL1 Dopamine D2 receptor and serotonin 1a receptor HTR1A | Serotonin receptor 1A
Type:
Mol. Mass.:
46122.49
Organism:
Homo sapiens (Human)
Description:
Residue:
422
  
Inhibitor
Name:
BDBM30694
Synonyms:
(5,6-Dimethyl-4-oxo-4H-thieno[2,3-d]pyrimidin-3-yl)-acetic acid 1-tert-butylcarbamoyl-ethyl ester 2-(5,6-dimethyl-4-oxo-3-thieno[2,3-d]pyrimidinyl)acetic acid [1-(tert-butylamino)-1-oxopropan-2-yl] ester SMR000000460 [1-(tert-butylamino)-1-oxopropan-2-yl] 2-(5,6-dimethyl-4-oxothieno[2,3-d]pyrimidin-3-yl)acetate | cid_654522
Type:
Small organic molecule
Emp. Form.:
C17H23N3O4S
Mol. Mass.:
365.447
SMILES:
CC(OC(=O)Cn1cnc2sc(C)c(C)c2c1=O)C(=O)NC(C)(C)C
:
Substrate
Name:
Not Available
Synonyms:
Type:
Mol. Mass.:
358.43
Organism:
Description:
Residue:
3
NA