Target
5-hydroxytryptamine receptor 1A
Ligand
BDBM30699
Substrate
Not Available
Meas. Tech.
Dose Response Assay for Agonists of 5-Hydroxytryptamine (Serotonin) Receptor Subtype 1A (5HT1A)
pH
7.4±n/a
Temperature
296.15±n/a K
EC50
99000±n/a nM
Citation
 PubChem, PC Dose Response Assay for 5-Hydroxytryptamine (Serotonin) Receptor Subtype 1a (5HT1a) Agonists PubChem Bioassay (2007)[AID] 
Target
Name:
5-hydroxytryptamine receptor 1A
Synonyms:
5-HT-1A 5-hydroxytryptamine receptor 1A (5-HT-1A) ADRB2RL1 Dopamine D2 receptor and serotonin 1a receptor HTR1A | Serotonin receptor 1A
Type:
Mol. Mass.:
46122.49
Organism:
Homo sapiens (Human)
Description:
Residue:
422
  
Inhibitor
Name:
BDBM30699
Synonyms:
2-[5-(2-Methyl-furan-3-yl)-4-m-tolyl-4H-[1,2,4]triazol-3-ylsulfanyl]-N-(4-methyl-furazan-3-yl)-acetamide 2-[[5-(2-methylfuran-3-yl)-4-(3-methylphenyl)-1,2,4-triazol-3-yl]sulfanyl]-N-(4-methyl-1,2,5-oxadiazol-3-yl)acetamide MLS000032843 SMR000005746 | cid_656133
Type:
Small organic molecule
Emp. Form.:
C19H18N6O3S
Mol. Mass.:
410.45
SMILES:
Cc1nonc1NC(=O)CSc1nnc(-c2ccoc2C)n1-c1cccc(C)c1
:
Substrate
Name:
Not Available
Synonyms:
Type:
Mol. Mass.:
358.43
Organism:
Description:
Residue:
3
NA