Target
5-hydroxytryptamine receptor 1A
Ligand
BDBM30787
Substrate
Not Available
Meas. Tech.
Dose Response Assay for Agonists of 5-Hydroxytryptamine (Serotonin) Receptor Subtype 1A (5HT1A)
pH
7.4±n/a
Temperature
296.15±n/a K
EC50
99000±n/a nM
Citation
 PubChem, PC Dose Response Assay for 5-Hydroxytryptamine (Serotonin) Receptor Subtype 1a (5HT1a) Agonists PubChem Bioassay (2007)[AID] 
Target
Name:
5-hydroxytryptamine receptor 1A
Synonyms:
5-HT-1A 5-hydroxytryptamine receptor 1A (5-HT-1A) ADRB2RL1 Dopamine D2 receptor and serotonin 1a receptor HTR1A | Serotonin receptor 1A
Type:
Mol. Mass.:
46122.49
Organism:
Homo sapiens (Human)
Description:
Residue:
422
  
Inhibitor
Name:
BDBM30787
Synonyms:
MLS000083871 N-(2-furfuryl)-N-[(2-keto-1H-quinolin-3-yl)methyl]thiophene-2-carboxamide N-(furan-2-ylmethyl)-N-[(2-oxo-1H-quinolin-3-yl)methyl]thiophene-2-carboxamide cid_666545
Type:
Small organic molecule
Emp. Form.:
C20H16N2O3S
Mol. Mass.:
364.418
SMILES:
O=C(N(Cc1ccco1)Cc1cc2ccccc2[nH]c1=O)c1cccs1
:
Substrate
Name:
Not Available
Synonyms:
Type:
Mol. Mass.:
358.43
Organism:
Description:
Residue:
3
NA