Target
5-hydroxytryptamine receptor 1A
Ligand
BDBM30831
Substrate
Not Available
Meas. Tech.
Dose Response Assay for Agonists of 5-Hydroxytryptamine (Serotonin) Receptor Subtype 1A (5HT1A)
pH
7.4±n/a
Temperature
296.15±n/a K
EC50
21500±n/a nM
Citation
 PubChem, PC Dose Response Assay for 5-Hydroxytryptamine (Serotonin) Receptor Subtype 1a (5HT1a) Agonists PubChem Bioassay (2007)[AID] 
Target
Name:
5-hydroxytryptamine receptor 1A
Synonyms:
5-HT-1A 5-hydroxytryptamine receptor 1A (5-HT-1A) ADRB2RL1 Dopamine D2 receptor and serotonin 1a receptor HTR1A | Serotonin receptor 1A
Type:
Mol. Mass.:
46122.49
Organism:
Homo sapiens (Human)
Description:
Residue:
422
  
Inhibitor
Name:
BDBM30831
Synonyms:
MLS000055622 N-(1-butyl-3-cyano-pyrrolo[3,2-b]quinoxalin-2-yl)-4-fluoranyl-benzamide N-(1-butyl-3-cyanopyrrolo[3,2-b]quinoxalin-2-yl)-4-fluorobenzamide US9045483, 13 | cid_2323827
Type:
Small organic molecule
Emp. Form.:
C22H18FN5O
Mol. Mass.:
387.4096
SMILES:
CCCCn1c(NC(=O)c2ccc(F)cc2)c(C#N)c2nc3ccccc3nc12
:
Substrate
Name:
Not Available
Synonyms:
Type:
Mol. Mass.:
358.43
Organism:
Description:
Residue:
3
NA