Target
5-hydroxytryptamine receptor 1A
Ligand
BDBM30876
Substrate
Not Available
Meas. Tech.
Dose Response Assay for Agonists of 5-Hydroxytryptamine (Serotonin) Receptor Subtype 1A (5HT1A)
pH
7.4±n/a
Temperature
296.15±n/a K
EC50
99000±n/a nM
Citation
 PubChem, PC Dose Response Assay for 5-Hydroxytryptamine (Serotonin) Receptor Subtype 1a (5HT1a) Agonists PubChem Bioassay (2007)[AID] 
Target
Name:
5-hydroxytryptamine receptor 1A
Synonyms:
5-HT-1A 5-hydroxytryptamine receptor 1A (5-HT-1A) ADRB2RL1 Dopamine D2 receptor and serotonin 1a receptor HTR1A | Serotonin receptor 1A
Type:
Mol. Mass.:
46122.49
Organism:
Homo sapiens (Human)
Description:
Residue:
422
  
Inhibitor
Name:
BDBM30876
Synonyms:
4-[[3-[(4-chlorophenyl)sulfonylamino]-3-(2-furanyl)-1-oxopropyl]amino]-1-piperidinecarboxylic acid ethyl ester MLS000047312 cid_3242013 ethyl 4-{[3-{[(4-chlorophenyl)sulfonyl]amino}-3-(2-furyl)propanoyl]amino}piperidine-1-carboxylate
Type:
Small organic molecule
Emp. Form.:
C21H26ClN3O6S
Mol. Mass.:
483.966
SMILES:
CCOC(=O)N1CCC(CC1)NC(=O)CC(NS(=O)(=O)c1ccc(Cl)cc1)c1ccco1
:
Substrate
Name:
Not Available
Synonyms:
Type:
Mol. Mass.:
358.43
Organism:
Description:
Residue:
3
NA