Target
5-hydroxytryptamine receptor 1A
Ligand
BDBM31017
Substrate
Not Available
Meas. Tech.
Dose Response Assay for Agonists of 5-Hydroxytryptamine (Serotonin) Receptor Subtype 1A (5HT1A)
pH
7.4±n/a
Temperature
296.15±n/a K
EC50
50000±n/a nM
Citation
 PubChem, PC Dose Response assay for agonists of 5-Hydroxytryptamine (Serotonin) Receptor Subtype 1A (5HT1A) PubChem Bioassay (2007)[AID] 
Target
Name:
5-hydroxytryptamine receptor 1A
Synonyms:
5-HT-1A 5-hydroxytryptamine receptor 1A (5-HT-1A) ADRB2RL1 Dopamine D2 receptor and serotonin 1a receptor HTR1A | Serotonin receptor 1A
Type:
Mol. Mass.:
46122.49
Organism:
Homo sapiens (Human)
Description:
Residue:
422
  
Inhibitor
Name:
BDBM31017
Synonyms:
MLS000056121 N-[2-(methylthio)-1,3-benzothiazol-6-yl]-2-oxolanecarboxamide SMR000067200 | cid_2999993
Type:
Small organic molecule
Emp. Form.:
C13H14N2O2S2
Mol. Mass.:
294.392
SMILES:
CSc1nc2ccc(NC(=O)C3CCCO3)cc2s1
:
Substrate
Name:
Not Available
Synonyms:
Type:
Mol. Mass.:
358.43
Organism:
Description:
Residue:
3
NA