Target
5-hydroxytryptamine receptor 1A
Ligand
BDBM31047
Substrate
Not Available
Meas. Tech.
Dose Response Assay for Agonists of 5-Hydroxytryptamine (Serotonin) Receptor Subtype 1A (5HT1A)
pH
7.4±n/a
Temperature
296.15±n/a K
IC50
40000±n/a nM
Citation
 PubChem, PC Dose Response Cell Based Assay for Antagonists of the 5-Hydroxytryptamine Receptor Subtype 1A (5HT1A) PubChem Bioassay (2007)[AID] 
Target
Name:
5-hydroxytryptamine receptor 1A
Synonyms:
5-HT-1A 5-hydroxytryptamine receptor 1A (5-HT-1A) ADRB2RL1 Dopamine D2 receptor and serotonin 1a receptor HTR1A | Serotonin receptor 1A
Type:
Mol. Mass.:
46122.49
Organism:
Homo sapiens (Human)
Description:
Residue:
422
  
Inhibitor
Name:
BDBM31047
Synonyms:
(5-Phenylsulfanyl-1H-benzoimidazol-2-yl)-carbamic acid methyl ester FENBENDAZOLE N-[6-(phenylthio)-1H-benzimidazol-2-yl]carbamic acid methyl ester cid_3334 methyl N-(6-phenylsulfanyl-1H-benzimidazol-2-yl)carbamate
Type:
Small organic molecule
Emp. Form.:
C15H13N3O2S
Mol. Mass.:
299.348
SMILES:
COC(=O)Nc1nc2ccc(Sc3ccccc3)cc2[nH]1
:
Substrate
Name:
Not Available
Synonyms:
Type:
Mol. Mass.:
358.43
Organism:
Description:
Residue:
3
NA