Target
5-hydroxytryptamine receptor 1A
Ligand
BDBM31056
Substrate
Not Available
Meas. Tech.
Dose Response Assay for Agonists of 5-Hydroxytryptamine (Serotonin) Receptor Subtype 1A (5HT1A)
pH
7.4±n/a
Temperature
296.15±n/a K
IC50
22200±n/a nM
Citation
 PubChem, PC Dose Response Cell Based Assay for Antagonists of the 5-Hydroxytryptamine Receptor Subtype 1A (5HT1A) PubChem Bioassay (2007)[AID] 
Target
Name:
5-hydroxytryptamine receptor 1A
Synonyms:
5-HT-1A 5-hydroxytryptamine receptor 1A (5-HT-1A) ADRB2RL1 Dopamine D2 receptor and serotonin 1a receptor HTR1A | Serotonin receptor 1A
Type:
Mol. Mass.:
46122.49
Organism:
Homo sapiens (Human)
Description:
Residue:
422
  
Inhibitor
Name:
BDBM31056
Synonyms:
6-(2,5-dimethoxyphenyl)-3-(3-ethoxyphenyl)-7H-[1,2,4]triazolo[3,4-b][1,3,4]thiadiazine MLS000081451 cid_662235
Type:
Small organic molecule
Emp. Form.:
C20H20N4O3S
Mol. Mass.:
396.463
SMILES:
CCOc1cccc(c1)-c1nnc2SCC(=Nn12)c1cc(OC)ccc1OC
:
Substrate
Name:
Not Available
Synonyms:
Type:
Mol. Mass.:
358.43
Organism:
Description:
Residue:
3
NA