Target
Receptor-type tyrosine-protein kinase FLT3 [D835H]
Ligand
BDBM25118
Substrate
biotinylated affinity ligand
Meas. Tech.
Kinase Inhibitor Selectivity Profiling Assay
pH
7.4±n/a
Temperature
298.15±n/a K
Kd
6.1±n/a nM
Citation
 PubChem, PC Kinase Inhibitor Selectivity Profiling Assay PubChem Bioassay (2008)[AID] 
Target
Name:
Receptor-type tyrosine-protein kinase FLT3 [D835H]
Synonyms:
CD135 FLK2 FLT3(D835H) Receptor-type tyrosine-protein kinase FLT3 (D835H) STK1 Tyrosine Kinase FLT3 Mutant (D835H)
Type:
Mol. Mass.:
112912.18
Organism:
Homo sapiens (Human)
Description:
P36888 D835H
Residue:
993
  
Inhibitor
Name:
BDBM25118
Synonyms:
(3Z)-4-amino-5-fluoro-3-[5-(4-methylpiperazino)-1,3-dihydrobenzimidazol-2-ylidene]carbostyril CHEMBL522892 | CHIR-258
Type:
Small organic molecule
Emp. Form.:
C21H21FN6O
Mol. Mass.:
392.4294
SMILES:
CN1CCN(CC1)c1ccc2nc([nH]c2c1)-c1c(N)c2c(F)cccc2[nH]c1=O
:
Substrate
Name:
biotinylated affinity ligand
Synonyms:
Type:
Mol. Mass.:
358.43
Organism:
Description:
Residue:
3
NA