Target
Receptor-type tyrosine-protein kinase FLT3 [N841I]
Ligand
BDBM31094
Substrate
biotinylated affinity ligand
Meas. Tech.
Kinase Inhibitor Selectivity Profiling Assay
pH
7.4±n/a
Temperature
298.15±n/a K
Kd
6.0±n/a nM
Citation
 PubChem, PC Kinase Inhibitor Selectivity Profiling Assay PubChem Bioassay (2008)[AID] 
Target
Name:
Receptor-type tyrosine-protein kinase FLT3 [N841I]
Synonyms:
CD135 FLT3 Receptor-type tyrosine-protein kinase FLT3 (N841I) Tyrosine Kinase FLT3 Mutant (N841I)
Type:
Tyrosine-protein kinase
Mol. Mass.:
112887.67
Organism:
Homo sapiens (Human)
Description:
gi_121114304
Residue:
993
  
Inhibitor
Name:
BDBM31094
Synonyms:
PKC-412 | cid_24202429
Type:
Small organic molecule
Emp. Form.:
C35H30N4O4
Mol. Mass.:
570.6371
SMILES:
[H][C@@]12C[C@@H]([C@H](OC)[C@@](C)(O1)n1c3ccccc3c3c4CNC(=O)c4c4c5ccccc5n2c4c13)N(C)C(=O)c1ccccc1
:
Substrate
Name:
biotinylated affinity ligand
Synonyms:
Type:
Mol. Mass.:
358.43
Organism:
Description:
Residue:
3
NA