Target
D-amino-acid oxidase
Ligand
BDBM31147
Substrate
BDBM23167
Meas. Tech.
DAAO in Vitro Activity Assay
pH
8.5±n/a
Temperature
295.15±n/a K
IC50
9±n/a nM
Citation
 Duplantier, AJBecker, SLBohanon, MJBorzilleri, KAChrunyk, BADowns, JTHu, LYEl-Kattan, AJames, LCLiu, SLu, JMaklad, NMansour, MNMente, SPiotrowski, MASakya, SMSheehan, SSteyn, SJStrick, CAWilliams, VAZhang, L Discovery, SAR, and pharmacokinetics of a novel 3-hydroxyquinolin-2(1H)-one series of potent D-amino acid oxidase (DAAO) inhibitors. J Med Chem 52:3576-85 (2009)  
Target
Name:
D-amino-acid oxidase
Synonyms:
D-amino-acid oxidase (DAAO) DAMOX OXDA_HUMAN
Type:
Homodimer
Mol. Mass.:
39476.06
Organism:
Homo sapiens (Human)
Description:
P14920
Residue:
347
  
Inhibitor
Name:
BDBM31147
Synonyms:
4H-furo[3,2-b]pyrrole-5-carboxylic acid CHEMBL492591
Type:
Small organic molecule
Emp. Form.:
C7H5NO3
Mol. Mass.:
151.1195
SMILES:
OC(=O)c1cc2occc2[nH]1
:
Substrate
Name:
BDBM23167
Synonyms:
(2R)-2-amino-3-hydroxypropanoic acid D-Serine
Type:
Amino Acid
Emp. Form.:
C3H7NO3
Mol. Mass.:
105.0926
SMILES:
N[C@H](CO)C(O)=O
: